{"text_format":"1","workbook":"xlsx","n_sheets":2,"sheets":["随机练习","题库"],"not_rendered":{"charts":0,"images":0,"macros":1,"external_links":0,"defined_names":0,"comments":0,"pivot_tables":0},"unopened":[],"bounds":{"document_bytes":16777216,"sheet_cells":100000,"rows_first":2000,"rows_last":500,"rows_between":2000,"halvings":0,"cell_chars":16384,"cell_head_chars":4096},"cells_cut":0,"cells_raw":0,"read":"whole","date_system":"1900"}

{"sheet":"随机练习","index":0,"n_rows":25,"n_cols":8,"rows_kept":25,"cut":false,"hidden":false,"merged":[[0,0,0,7]]}
["使用方法：ctrl+m 重新抽题，在回答列手动输入或用下拉列表选择\n打开文档时，如提示“安全警告 部分活动内容已被禁止。”请点击“启用内容”。\n制作者：caazy"]
[]
["题号","题目","A","B","C","D","回答","正确否"]
[214,{"$f":"VLOOKUP($A4,题库!$A:$I,COLUMN()+1,0)","v":"键盘上的“基准键”指的是______。\n"},{"$f":"VLOOKUP($A4,题库!$A:$I,COLUMN()+2,0)","v":"(A)\"D\"和\"K\"这两个键"},{"$f":"VLOOKUP($A4,题库!$A:$I,COLUMN()+2,0)","v":"(B)\"A、S、D、F\"和\"J、K、L、；\"这八个键"},{"$f":"VLOOKUP($A4,题库!$A:$I,COLUMN()+2,0)","v":"(C)\"1、2、3、4、5、6、7、8、9、0\"这十个键"},{"$f":"VLOOKUP($A4,题库!$A:$I,COLUMN()+2,0)","v":"(D)左右两个\"Shift\"键"},null,{"$f":"IF(G4=\"\",\"\",IF(G4=VLOOKUP($A4,题库!$A:$I,4,0),\"正确\",\"错误\"))","v":""}]
[480,{"$f":"VLOOKUP($A5,题库!$A:$I,COLUMN()+1,0)","v":"“ftp://ftp.download.com/pub/doc.txt”指向的是一个______。"},{"$f":"VLOOKUP($A5,题库!$A:$I,COLUMN()+2,0)","v":"(A)FTP站点"},{"$f":"VLOOKUP($A5,题库!$A:$I,COLUMN()+2,0)","v":"(B)FTP站点的一个文件夹"},{"$f":"VLOOKUP($A5,题库!$A:$I,COLUMN()+2,0)","v":"(C)FTP站点的一个文件"},{"$f":"VLOOKUP($A5,题库!$A:$I,COLUMN()+2,0)","v":"(D)地址表示错误"},null,{"$f":"IF(G5=\"\",\"\",IF(G5=VLOOKUP($A5,题库!$A:$I,4,0),\"正确\",\"错误\"))","v":""}]
[491,{"$f":"VLOOKUP($A6,题库!$A:$I,COLUMN()+1,0)","v":"因特网中的域名服务器系统负责全网IP地址的解析工作，它的好处是______。\n"},{"$f":"VLOOKUP($A6,题库!$A:$I,COLUMN()+2,0)","v":"(A)IP地址从32位的二进制地址缩减为8位的二进制地址"},{"$f":"VLOOKUP($A6,题库!$A:$I,COLUMN()+2,0)","v":"(B)IP协议再也不需要了"},{"$f":"VLOOKUP($A6,题库!$A:$I,COLUMN()+2,0)","v":"(C)用户只需要简单地记住一个网站域名，而不必记住IP地址"},{"$f":"VLOOKUP($A6,题库!$A:$I,COLUMN()+2,0)","v":"(D)IP地址再也不需要了"},null,{"$f":"IF(G6=\"\",\"\",IF(G6=VLOOKUP($A6,题库!$A:$I,4,0),\"正确\",\"错误\"))","v":""}]
[7,{"$f":"VLOOKUP($A7,题库!$A:$I,COLUMN()+1,0)","v":"我国的国家标准GB2312用______位二进制数来表示一个汉字。"},{"$f":"VLOOKUP($A7,题库!$A:$I,COLUMN()+2,0)","v":"(A)8"},{"$f":"VLOOKUP($A7,题库!$A:$I,COLUMN()+2,0)","v":"(B)16"},{"$f":"VLOOKUP($A7,题库!$A:$I,COLUMN()+2,0)","v":"(C)4"},{"$f":"VLOOKUP($A7,题库!$A:$I,COLUMN()+2,0)","v":"(D)7"},null,{"$f":"IF(G7=\"\",\"\",IF(G7=VLOOKUP($A7,题库!$A:$I,4,0),\"正确\",\"错误\"))","v":""}]
[312,{"$f":"VLOOKUP($A8,题库!$A:$I,COLUMN()+1,0)","v":"计算机能直接执行的指令包括两个部分，它们是_______。"},{"$f":"VLOOKUP($A8,题库!$A:$I,COLUMN()+2,0)","v":"(A)源操作数和目标操作数"},{"$f":"VLOOKUP($A8,题库!$A:$I,COLUMN()+2,0)","v":"(B)操作码和操作数"},{"$f":"VLOOKUP($A8,题库!$A:$I,COLUMN()+2,0)","v":"(C)ASCII码和汉字代码"},{"$f":"VLOOKUP($A8,题库!$A:$I,COLUMN()+2,0)","v":"(D)数字和文字"},null,{"$f":"IF(G8=\"\",\"\",IF(G8=VLOOKUP($A8,题库!$A:$I,4,0),\"正确\",\"错误\"))","v":""}]
[484,{"$f":"VLOOKUP($A9,题库!$A:$I,COLUMN()+1,0)","v":"通过计算机网络可以进行收发电子邮件，它除了可收发普通电子邮件外，还可以______。\n"},{"$f":"VLOOKUP($A9,题库!$A:$I,COLUMN()+2,0)","v":"(A)传送计算机软件"},{"$f":"VLOOKUP($A9,题库!$A:$I,COLUMN()+2,0)","v":"(B)传送语言"},{"$f":"VLOOKUP($A9,题库!$A:$I,COLUMN()+2,0)","v":"(C)订阅电子报刊"},{"$f":"VLOOKUP($A9,题库!$A:$I,COLUMN()+2,0)","v":"(D)以上都对"},null,{"$f":"IF(G9=\"\",\"\",IF(G9=VLOOKUP($A9,题库!$A:$I,4,0),\"正确\",\"错误\"))","v":""}]
[272,{"$f":"VLOOKUP($A10,题库!$A:$I,COLUMN()+1,0)","v":"在下列软件中，属于系统软件的是______。\n"},{"$f":"VLOOKUP($A10,题库!$A:$I,COLUMN()+2,0)","v":"(A)WPS"},{"$f":"VLOOKUP($A10,题库!$A:$I,COLUMN()+2,0)","v":"(B)CCED"},{"$f":"VLOOKUP($A10,题库!$A:$I,COLUMN()+2,0)","v":"(C)WORD"},{"$f":"VLOOKUP($A10,题库!$A:$I,COLUMN()+2,0)","v":"(D)DOS"},null,{"$f":"IF(G10=\"\",\"\",IF(G10=VLOOKUP($A10,题库!$A:$I,4,0),\"正确\",\"错误\"))","v":""}]
[237,{"$f":"VLOOKUP($A11,题库!$A:$I,COLUMN()+1,0)","v":"硬盘连同驱动器是一种______。\n"},{"$f":"VLOOKUP($A11,题库!$A:$I,COLUMN()+2,0)","v":"(A)数据库管理系统"},{"$f":"VLOOKUP($A11,题库!$A:$I,COLUMN()+2,0)","v":"(B)外存储器"},{"$f":"VLOOKUP($A11,题库!$A:$I,COLUMN()+2,0)","v":"(C)内存储器"},{"$f":"VLOOKUP($A11,题库!$A:$I,COLUMN()+2,0)","v":"(D)数据库"},null,{"$f":"IF(G11=\"\",\"\",IF(G11=VLOOKUP($A11,题库!$A:$I,4,0),\"正确\",\"错误\"))","v":""}]
[437,{"$f":"VLOOKUP($A12,题库!$A:$I,COLUMN()+1,0)","v":"计算机网络的主要目标是______。\n"},{"$f":"VLOOKUP($A12,题库!$A:$I,COLUMN()+2,0)","v":"(A)分布处理"},{"$f":"VLOOKUP($A12,题库!$A:$I,COLUMN()+2,0)","v":"(B)将多台计算机连接起来"},{"$f":"VLOOKUP($A12,题库!$A:$I,COLUMN()+2,0)","v":"(C)提高计算机可靠性"},{"$f":"VLOOKUP($A12,题库!$A:$I,COLUMN()+2,0)","v":"(D)共享软件、硬件和数据资源"},null,{"$f":"IF(G12=\"\",\"\",IF(G12=VLOOKUP($A12,题库!$A:$I,4,0),\"正确\",\"错误\"))","v":""}]
[84,{"$f":"VLOOKUP($A13,题库!$A:$I,COLUMN()+1,0)","v":"微机中1K字节表示的二进制位数是______。\n"},{"$f":"VLOOKUP($A13,题库!$A:$I,COLUMN()+2,0)","v":"(A)1000"},{"$f":"VLOOKUP($A13,题库!$A:$I,COLUMN()+2,0)","v":"(B)8×1000"},{"$f":"VLOOKUP($A13,题库!$A:$I,COLUMN()+2,0)","v":"(C)1024"},{"$f":"VLOOKUP($A13,题库!$A:$I,COLUMN()+2,0)","v":"(D)8×1024"},null,{"$f":"IF(G13=\"\",\"\",IF(G13=VLOOKUP($A13,题库!$A:$I,4,0),\"正确\",\"错误\"))","v":""}]
[]
["判断编号","题目","回答","正确否"]
[437,{"$f":"VLOOKUP($A16+580,题库!$A:$I,COLUMN()+1,0)","v":"计算机病毒的传染性，就是指它的自我复制能力。"},null,{"$f":"IF(C16=\"\",\"\",IF(C16=VLOOKUP($A16+580,题库!$A:$I,4,0),\"正确\",\"错误\"))","v":""}]
[201,{"$f":"VLOOKUP($A17+580,题库!$A:$I,COLUMN()+1,0)","v":"Java语言指超文本标记语言。\n"},null,{"$f":"IF(C17=\"\",\"\",IF(C17=VLOOKUP($A17+580,题库!$A:$I,4,0),\"正确\",\"错误\"))","v":""}]
[136,{"$f":"VLOOKUP($A18+580,题库!$A:$I,COLUMN()+1,0)","v":"在Windows中，用户可以对磁盘进行快速格式化，但是被格式化的磁盘必须是以前做过格式化的磁盘。"},null,{"$f":"IF(C18=\"\",\"\",IF(C18=VLOOKUP($A18+580,题库!$A:$I,4,0),\"正确\",\"错误\"))","v":""}]
[159,{"$f":"VLOOKUP($A19+580,题库!$A:$I,COLUMN()+1,0)","v":"从物理上拔出优盘之前，应先使用“拨下或弹出硬件”程序停止优盘工作，以防数据丢失或优盘故障。"},null,{"$f":"IF(C19=\"\",\"\",IF(C19=VLOOKUP($A19+580,题库!$A:$I,4,0),\"正确\",\"错误\"))","v":""}]
[206,{"$f":"VLOOKUP($A20+580,题库!$A:$I,COLUMN()+1,0)","v":"算法至少应该有一个输出。"},null,{"$f":"IF(C20=\"\",\"\",IF(C20=VLOOKUP($A20+580,题库!$A:$I,4,0),\"正确\",\"错误\"))","v":""}]
[409,{"$f":"VLOOKUP($A21+580,题库!$A:$I,COLUMN()+1,0)","v":"邮件接收遵守POP协议。"},null,{"$f":"IF(C21=\"\",\"\",IF(C21=VLOOKUP($A21+580,题库!$A:$I,4,0),\"正确\",\"错误\"))","v":""}]
[67,{"$f":"VLOOKUP($A22+580,题库!$A:$I,COLUMN()+1,0)","v":"一个16×16点阵的汉字，其字形需要占256个字节的存储空间。"},null,{"$f":"IF(C22=\"\",\"\",IF(C22=VLOOKUP($A22+580,题库!$A:$I,4,0),\"正确\",\"错误\"))","v":""}]
[262,{"$f":"VLOOKUP($A23+580,题库!$A:$I,COLUMN()+1,0)","v":"在Windows环境下，文件主名的取法，可以使用任意可显示字符。"},null,{"$f":"IF(C23=\"\",\"\",IF(C23=VLOOKUP($A23+580,题库!$A:$I,4,0),\"正确\",\"错误\"))","v":""}]
[314,{"$f":"VLOOKUP($A24+580,题库!$A:$I,COLUMN()+1,0)","v":"工作簿是Excel中存储电子表格的一种基本文件，其系统默认扩展名为.xls。\n"},null,{"$f":"IF(C24=\"\",\"\",IF(C24=VLOOKUP($A24+580,题库!$A:$I,4,0),\"正确\",\"错误\"))","v":""}]
[381,{"$f":"VLOOKUP($A25+580,题库!$A:$I,COLUMN()+1,0)","v":"根据计算机网络覆盖地理范围的大小，网络可分为广域网和以太网。"},null,{"$f":"IF(C25=\"\",\"\",IF(C25=VLOOKUP($A25+580,题库!$A:$I,4,0),\"正确\",\"错误\"))","v":""}]

{"sheet":"题库","index":1,"n_rows":1071,"n_cols":8,"rows_kept":1071,"cut":false,"hidden":true,"merged":[]}
["编号","题型","题目","答案","A","B","C","D"]
[1,"单选","下列有关信息的描述正确的是______。\n","C","(A)只有以书本的形式才能长期保存信息","(B)数字信号比模拟信号易受干扰而导致失真","(C)计算机以数字化的方式对各种信息进行处理","(D)信息的数字化技术已初步被模拟化技术所取代"]
[2,"单选","现代信息社会的主要标志是_____。\n","D","(A)汽车的大量使用","(B)人口的日益增长","(C)自然环境的不断改善","(D)计算机技术的大量应用"]
[3,"单选","当今的信息技术，主要是指______。\n","C","(A)计算机技术","(B)网络技术","(C)计算机和网络通信技术","(D)多媒体技术"]
[4,"单选","你认为最能准确反映计算机主要功能的是______。\n","D","(A)计算机可以代替人的脑力劳动","(B)计算机可以存储大量的信息","(C)计算机可以实现高速度的运算","(D)计算机是一种信息处理机"]
[5,"单选","信息化社会的核心基础是______。\n","D","(A)通信","(B)控制","(C)Internet","(D)计算机"]
[6,"单选","在计算机中，用文字、图像、语言、情景、现象所表示的内容都可称为______。\n","D","(A)表象","(B)文章","(C)消息","(D)信息"]
[7,"单选","我国的国家标准GB2312用______位二进制数来表示一个汉字。","B","(A)8","(B)16","(C)4","(D)7"]
[8,"单选","按对应的ASCII码比较，下列正确的是______。\n","B","(A)\"A\"比\"B\" 大","(B)\"f\"比\"Q\"大","(C)空格比逗号大","(D)\"H\"比\"R\"大"]
[9,"单选","人类处理信息的历史大致分为原始阶段、手工阶段、______和现代阶段。     \n\n","D","(A)生产阶段","(B)半导体阶段","(C)信息阶段","(D)机电阶段"]
[10,"单选","______是基于半导体材料，采用微米级甚至纳米级加工工艺制造微小型化电子元器件和微型化电路的技术。\n","B","(A)微制造技术","(B)微电子技术","(C)微型计算机技术","(D)嵌入式技术"]
[11,"单选","1948年,______《通信的数学理论》的论述，现在被称为信息理论。论文明确了信息量的定量表示方法。      \n\n","A","(A)仙农","(B)西蒙","(C)维纳","(D)冯·诺依曼"]
[12,"单选","______可以理解为与信息处理有关的一切技术，或者说是依据信息科学的原理和方法来实现信息的收集、识别、提取、变换、存贮、传递、处理、检索、检测、分析和利用等的技术。","B","(A)编程技术","(B)信息技术","(C)网络技术","(D)数据库技术"]
[13,"单选","______定律是由Intel公司创始人之一于1965年提出的，它揭示了集成电路的飞速发展，后来这一定律表达为每18个月（即1.5年）集成电路（integrate circuit，IC）器件数翻一番。","C","(A)仙农","(B)曼卡夫","(C)摩尔","(D)冯·诺依曼"]
[14,"单选","______是信息产业发展的基础。 \n","D","(A)系统软件","(B)应用软件","(C)移动硬盘","(D)集成电路"]
[15,"单选","计算机______是指由计算机及其相关的和配套的设备、设施（含网络）构成的，按照一定的应用目标和规则对信息进行采集、加工、存储、传输、检索等处理的人机系统。\n\n","C","(A)硬件系统","(B)软件系统","(C)信息系统","(D)嵌入式系统"]
[16,"单选","信息系统可以看成是由一系列有序的______构成的。     \n\n","A","(A)模型","(B)软件","(C)存储系统","(D)目标系统"]
[17,"单选","电子商务主要是利用计算机______进行的一种商贸活动。     \n\n","B","(A)存储","(B)网络","(C)货物运输","(D)控制"]
[18,"单选","对于R进制来说，其基数（能使用的数字符号个数）是______。","B","(A)R-1","(B)R","(C)R+1","(D)2R"]
[19,"单选","在计算机应用中，“计算机辅助制造”的英文缩写是______。\n","B","(A)CAD","(B)CAM","(C)CAI","(D)CAT"]
[20,"单选","计算机辅助设计的英文缩写是______。","A","(A)CAD","(B)CAI","(C)CAM","(D)CAT"]
[21,"单选","电子计算机的性能可以用很多指标来衡量，除了用其运算速度、字长等指标以外，______也作为主要指标。","A","(A)主存储器容量的大小","(B)硬盘容量的大小","(C)显示器的尺寸","(D)计算机的制造成本"]
[22,"单选","\"CAI\"的中文意思是______。\n","A","(A)计算机辅助教学","(B)计算机辅助设计","(C)计算机辅助制造","(D)计算机辅助管理"]
[23,"单选","目前广泛使用的计算机绝大多数是微型计算机，属于第四代计算机，它是随着大规模集成电路和发展而发展起来的。美国英特尔公司制成的第一片微处理器（CPU）是在______。\n","C","(A)40年代末","(B)50年代初","(C)70年代初","(D)80年代初"]
[24,"单选","由于微型计算机在工业自动化控制方面的广泛应用，它可以______。\n","D","(A)节省劳动力，减轻劳动强度，提高生产效率","(B)节省原料，减少能源消耗，降低生产成本","(C)代替危险性较大的工作岗位上人工操作","(D)以上都对"]
[25,"单选","现在的计算机性能越来越强，而操作却越来越简单，这是因为______。\n","D","(A)计算机中广泛地使用了鼠标和菜单技术","(B)计算机的操作界面越来越图形化","(C)硬件和软件的设计者为普及应用计算机作了大量的研究","(D)以上都对"]
[26,"单选","微型计算机中使用的数据库管理系统，属于下列计算机应用中的______。\n","C","(A)人工智能","(B)专家系统","(C)信息管理","(D)科学计算"]
[27,"单选","计算机的发展趋势是巨型化、微小化、网络化、______、多媒体化。\n","A","(A)智能化","(B)数字化","(C)自动化","(D)以上都对"]
[28,"单选","世界上第一台电子数字计算机研制成功的时间是______年。","B","(A)1936","(B)1946","(C)1956","(D)1975"]
[29,"单选","决策支持系统是计算机的一项应用，按计算机应用的分类，它属于______。\n","C","(A)科学计算","(B)实时控制","(C)数据处理","(D)辅助设计"]
[30,"单选","目前，制造计算机所使用的电子器件是______。\n","D","(A)大规模集成电路","(B)晶体管","(C)集成电路","(D)大规模集成电路和超大规模集成电路"]
[31,"单选","第二代计算机采用的电子器件是______。","A","(A)晶体管","(B)电子管","(C)中小规模集成电路","(D)超大规模集成电路"]
[32,"单选","世界上第一台电子数字计算机取名为______。","C","(A)UNIVAC","(B)EDSAC","(C)ENIAC","(D)EDVAC"]
[33,"单选","从第一台数字电子计算机诞生到现在的几十年中，按计算机采用的电子器件来划分，计算机的发展经历了______个阶段。","A","(A)4","(B)6","(C)7","(D)3"]
[34,"单选","从第一台计算机诞生到现在的几十年中，按计算机采用的_________来划分，计算机的发展经历了4个阶段。","C","(A)存储器","(B)计算机语言","(C)电子器件","(D)体积"]
[35,"单选","从第一代电子数字计算机到第四代计算机大部分体系结构都是相同的，是由运算器、控制器、存储器以及输入/输出设备组成的，称为______体系结构。","D","(A)艾伦·图灵","(B)罗伯特·诺伊斯","(C)比尔·盖茨","(D)冯·诺依曼"]
[36,"单选","计算机的发展阶段通常是按计算机所采用的______来划分的。","B","(A)内存容量","(B)电子器件","(C)程序设计语言","(D)操作系统"]
[37,"单选","我国自行设计研制的银河Ⅱ型计算机是______。","D","(A)微型计算机","(B)小型计算机","(C)中型计算机","(D)巨型计算机"]
[38,"单选","采用大规模集成电路或超大规模集成电路的计算机属于______计算机。\n","D","(A)第一代","(B)第二代","(C)第三代","(D)第四代"]
[39,"单选","计算机辅助教学的英文缩写是______。","B","(A)CAD","(B)CAI","(C)CAM","(D)CAT"]
[40,"单选","Intel 80286 是______位微处理器芯片。","B","(A)8","(B)16","(C)32","(D)64"]
[41,"单选","通常我们说的Intel CPU PIII 800 中的800是指______。","D","(A)生产编号","(B)无实际意义","(C)计算机名字","(D)CPU时钟频率"]
[42,"单选","世界上第一台电子计算机是于______诞生在______。\n","B","(A)1946年、法国","(B)1946年、美国","(C)1946年、英国","(D)1946年、德国"]
[43,"单选","第四代电子计算机硬件系统是以______为电子元器件的计算机。\n","C","(A)晶体管","(B)电子管","(C)大规模或超大规模集成电路","(D)继电器"]
[44,"单选","个人计算机简称PC机。这种计算机属于______。\n","A","(A)微型计算机","(B)小型计算机","(C)超级计算机","(D)巨型计算机"]
[45,"单选","Intel 80486 是______位微处理器芯片。","C","(A)8","(B)16","(C)32","(D)64"]
[46,"单选","“奔腾”第一代兼容的微型计算机采用的CPU芯片的型号是______。","D","(A)80286","(B)80386","(C)80486","(D)80586"]
[47,"单选","巨型计算机指的是______。","C","(A)重量大","(B)体积大","(C)功能强","(D)耗电量大"]
[48,"单选","科学家_______被计算机界称誉为“计算机之父”，他的存储程序原则被誉为计算机发展史上的一个里程碑。","C","(A)查尔斯·巴贝奇","(B)莫奇莱","(C)冯·诺依曼","(D)艾肯"]
[49,"单选","计算机最主要的工作特点是_______。","A","(A)存储程序与程序控制","(B)高速度与高精度","(C)可靠性与可用性","(D)有记忆能力"]
[50,"单选","______是以应用为中心、以计算机技术为基础、软件硬件可裁剪、适应应用系统，对功能、可靠性、成本、体积、功耗严格要求的专用计算机系统。","A","(A)嵌入式系统","(B)数据库系统","(C)多媒体系统","(D)集成电路系统"]
[51,"单选","计算机可以对提供的信息进行识别和比较，并确定下一步应该完成的操作。这一特点属于______。","C","(A)运算精度高","(B)存储量大","(C)逻辑判断能力","(D)通用性强"]
[52,"单选","计算机的运行速度越来越快，已从第一代时的每秒几万次发展到每秒数______次。\n","D","(A)千万","(B)亿","(C)十亿","(D)百万亿"]
[53,"单选","子符串“大学COMPUTER”(双引号除外),占用的存储字节数是_______。","C","(A)6","(B)10","(C)12","(D)24"]
[54,"单选","与十进制数56等值的二进制数是______。","A","(A)111000","(B)111001","(C)101111","(D)110110"]
[55,"单选","与十进制数93等值的二进制数是______。","D","(A)1101011","(B)1111001","(C)1011100","(D)1011101"]
[56,"单选","在下列四条叙述中，正确的是______。","A","(A)计算机中所有的信息都以二进制形式存放","(B)256KB等于256 000 字节","(C)2MB等于2 000 000 字节","(D)八进制数的基数为8，因此在八进制中可以使用的数字符号是0、1、2、3、4、5、6、7、8"]
[57,"单选","在计算机中应用最普遍的字符编码是______。\n","B","(A)国标码","(B)ASCII码","(C)EBCDIC码","(D)BCD码"]
[58,"单选","下列数据中，有可能是八进制数的是______。","B","(A)488","(B)317","(C)597","(D)189"]
[59,"单选","十进制小数0.625转换成八进制小数是______。","B","(A)0.05","(B)0.5","(C)0.6","(D)0.005"]
[60,"单选","十进制数267转换成八进制数是______。","D","(A)326","(B)410","(C)314","(D)413"]
[61,"单选","在计算机内部，一切信息的存取、处理和传送都是以______形式进行的。","D","(A)EBCDIC码","(B)ASCII码","(C)十六进制","(D)二进制"]
[62,"单选","十进制数59转换成八进制数是______。","A","(A)73","(B)37","(C)59","(D)112"]
[63,"单选","十进制数36.875转换成二进制数是______。","B","(A)110100.011","(B)100100.111","(C)100110.111","(D)100101.101"]
[64,"单选","十进制小数0.5625转换成二进制小数是______。","A","(A)0.1001","(B)1.0011","(C)0.1011","(D)0.0111"]
[65,"单选","十进制小数0.6875转换成二进制数是______。","C","(A)0.1101","(B)0.0111","(C)0.1011","(D)0.1100"]
[66,"单选","十进制数153转换成二进制数是______。","D","(A)10110110","(B)10100001","(C)10000110","(D)10011001"]
[67,"单选","十进制数124转换成二进制数是______。","B","(A)1111010","(B)1111100","(C)1011111","(D)1111011"]
[68,"单选","十进制数89转换成十六进制数是______。","B","(A)95","(B)59","(C)950","(D)89"]
[69,"单选","计算机存储数据的最小单位是二进制的_______。","A","(A)位（比特）","(B)字节","(C)字长","(D)千字节"]
[70,"单选","下列有关信息的描述不正确的是______。\n","A","(A)模拟信号能够直接被计算机处理","(B)声音、文字、图像都是信息的载体","(C)调制解调器能将模拟信号转化为数字信号","(D)计算机以数字化的方式对各种信息进行处理"]
[71,"单选","已知英文小写字母a的ASCII码为十六进制数61H，则英文小写字母d的ASCII码为_______。","C","(A)34H","(B)54H","(C)64H","(D)24H"]
[72,"单选","已知英文小写字母m的ASCII码为十进制数109，则英文小写字母y的ASCII码为十进制数_______。","C","(A)119","(B)120","(C)121","(D)122"]
[73,"单选","已知英文小写字母d的ASCII码为十进制数100，则英文小写字母h的ASCII码为十进制数_______。","B","(A)103","(B)104","(C)105","(D)106"]
[74,"单选","已知英文大写字母G的ASCII码为十进制数71，则英文大写字母W的ASCII码为十进制数_______。","D","(A)84","(B)85","(C)86","(D)87"]
[75,"单选","已知英文大写字母A的ASCII码为十进制数65，则英文大写字母E的ASCII码为十进制数_______。","C","(A)67","(B)68","(C)69","(D)70"]
[76,"单选","数字字符2的ASCII码为十进制数50，数字字符5的ASCII码为十进制数______。","B","(A)52","(B)53","(C)54","(D)55"]
[77,"单选","数字字符4的ASCII码为十进制数52，数字字符9的ASCII码为十进制数______。","A","(A)57","(B)58","(C)59","(D)60"]
[78,"单选","二进制数1110与1101算术相乘的结果是二进制数______。","C","(A)10110101","(B)11010110","(C)10110110","(D)10101101"]
[79,"单选","关于基本ASCII码，在计算机中的表示方法准确的描述是______。","D","(A)使用8位二进制数，最右边一位为1","(B)使用8位二进制数，最左边一位为1","(C)使用8位二进制数，最右边一位为0","(D)使用8位二进制数，最左边一位为0"]
[80,"单选","将二进制数10000001转换成十进制数应该是______。","A","(A)129","(B)127","(C)126","(D)128"]
[81,"单选","在下列四条叙述中，正确的一条是______。","B","(A)在计算机中，数据单位bit的意思是字节","(B)一个字节为8个二进制位","(C)所有的十进制小数都能完全准确的转换成二进制小数","(D)十进制数56转换成十六进制码是39H"]
[82,"单选","十进制小数0.6875转换成八进制小数是______。","C","(A)0.045","(B)0.054","(C)0.54","(D)0.45"]
[83,"单选","在下列四条叙述中，正确的一条是______。","B","(A)在计算机中，汉字的区位码就是机内码","(B)在汉字国标码GB2312-80的字符集中，共收集了6763个常用汉字","(C)英文小写字母e的ASCII码为101，则可推算出英文小写字母h的ASCII码为103","(D)存放80个24×24点阵的汉字字模信息需要占用2560个字节"]
[84,"单选","微机中1K字节表示的二进制位数是______。\n","D","(A)1000","(B)8×1000","(C)1024","(D)8×1024"]
[85,"单选","下列字符中，其ASCII码值最大的是______。\n","D","(A)9","(B)D","(C)a","(D)y"]
[86,"单选","二进制数10111101110转换成八进制数是______。","D","(A)2743","(B)5732","(C)6572","(D)2756"]
[87,"单选","十六进制数2A3C转换成十进制数是______。","C","(A)11802","(B)16132","(C)10812","(D)10802"]
[88,"单选","八进制数35.54转换成十进制数是______。","D","(A)29.1275","(B)29.2815","(C)29.0625","(D)29.6875"]
[89,"单选","八进制数413转换成十进制数是______。","B","(A)324","(B)267","(C)299","(D)265"]
[90,"单选","十六进制数1CB.D8转换成二进制数是______。","D","(A)110001011.11001","(B)101001011.10011","(C)111101011.11101","(D)111001011.11011"]
[91,"单选","十六进制数10AC转换成二进制数是______。","C","(A)1101110101110","(B)1010010101001","(C)1000010101100","(D)1011010101100"]
[92,"单选","八进制数253.74转换成二进制数是______。","A","(A)10101011.1111","(B)10111011.0101","(C)11001011.1001","(D)10101111.1011"]
[93,"单选","二进制数111010.11转换成十六进制数是______。","B","(A)3AC","(B)3A.C","(C)3A3","(D)3A.3"]
[94,"单选","二进制数10111101111转换成十六进制数是______。","D","(A)FE5","(B)2757","(C)17B3","(D)5EF"]
[95,"单选","二进制数10011010.1011转换成八进制数是______。","A","(A)232.54","(B)232.13","(C)232.51","(D)232.52"]
[96,"单选","十六进制数1CB.D8转换成十进制数是______。","A","(A)459.84375","(B)459.28125","(C)457.28175","(D)456.84375"]
[97,"单选","二进制数110100转换成八进制数是______。","B","(A)21","(B)64","(C)54","(D)46"]
[98,"单选","二进制数101.011转换成十进制数是______。","D","(A)5.175","(B)5.75","(C)5.125","(D)5.375"]
[99,"单选","二进制数1111100转换成十进制数是______。","C","(A)62","(B)60","(C)124","(D)248"]
[100,"单选","二进制数10111转换成十进制数是______。","C","(A)53","(B)32","(C)23","(D)46"]
[101,"单选","十进制数58.75转换成十六进制数是______。","B","(A)A3.C","(B)3A.C","(C)3A.12","(D)C.3A"]
[102,"单选","十进制小数0.6875转换成十六进制小数是______。","D","(A)0.011","(B)0.11","(C)0.0B","(D)0.B"]
[103,"单选","十进制小数0.625转换成十六进制小数是______。","A","(A)0.A","(B)0.1","(C)0.01","(D)0.001"]
[104,"单选","十进制数378转换成十六进制数是______。","C","(A)A71","(B)1710","(C)17A","(D)1071"]
[105,"单选","二进制数111010011转换成十六进制数是______。","B","(A)323","(B)1D3","(C)133","(D)3D1"]
[106,"单选","十六进制数1A8F转换成十进制数是______。","D","(A)7652","(B)6787","(C)7672","(D)6799"]
[107,"单选","十六进制数35.54转换成十进制数是______。","B","(A)35.32815","(B)53.328125","(C)54.328175","(D)52.62125"]
[108,"单选","有一个数值152，它与十六进制数6A相等，那么该数值是______。","D","(A)十进制数","(B)二进制数","(C)四进制数","(D)八进制数"]
[109,"单选","在下列无符号十进制数中，能用8位二进制数表示的是______。","A","(A)255","(B)256","(C)317","(D)289"]
[110,"单选","下面几个不同进制的数中，最小的数是______。","B","(A)二进制数1011100","(B)十进制数35","(C)八进制数47","(D)十六进制数2E"]
[111,"单选","下面几个不同进制的数中，最小的数是______。","C","(A)二进制数1001001","(B)十进制数75","(C)八进制数37","(D)十六进制数A7"]
[112,"单选","下面几个不同进制的数中，最大的数是______。","A","(A)十六进制数1011","(B)十进制数1011","(C)八进制数1011","(D)二进制数1011"]
[113,"单选","下面几个不同进制的数中，最大的数是______。","D","(A)而进制数11000010","(B)八进制数225","(C)十进制数500","(D)十六进制数1FE"]
[114,"单选","十六进制数FF.1转换成十进制数是______。","C","(A)255.625","(B)250.1625","(C)255.0625","(D)250.0625"]
[115,"单选","十进制数49.875转换成八进制数是______。","D","(A)7.61","(B)16.7","(C)160.7","(D)61.7"]
[116,"单选","下列叙述中，正确的是______。\n","C","(A)中文Windows已经内置了五笔字型输入法","(B)中文Windows不能使用五笔字型输入法","(C)中文Windows提供汉字输入法接口，可以挂入五笔字型输入法","(D)中文Windows没有提供汉字输入接口"]
[117,"单选","在计算机中采用二进制，是因为______。\n","D","(A)这样可以降低硬件成本","(B)两个状态的系统具有稳定性","(C)二进制的运算法则简单","(D)上述三个原因"]
[118,"单选","中文Windows中包含的汉字库文件是用来解决______问题的。\n\n","D","(A)使用者输入的汉字在机内的存储","(B)输入时的键盘编码","(C)汉字识别","(D)输出时转换为显示或打印字模"]
[119,"单选","向计算机输入中文信息的方式有_____。\n","D","(A)键盘","(B)语音","(C)手写","(D)以上都对"]
{"$rows_left_out":951}